Target
Ephrin type-A receptor 4
Ligand
BDBM50463479
Substrate
Meas. Tech.
ChEMBL_1778355 (CHEMBL4235347)
Ki
>10000±n/a nM
Citation
 Bandarage, UKCao, JCome, JHCourt, JJGao, HJacobs, MDMarhefka, CNanthakumar, SGreen, J ROCK inhibitors 3: Design, synthesis and structure-activity relationships of 7-azaindole-based Rho kinase (ROCK) inhibitors. Bioorg Med Chem Lett 28:2622-2626 (2018)  
Target
Name:
Ephrin type-A receptor 4
Synonyms:
EPHA4 Ephrin receptor HEK8 TYRO1
Type:
PROTEIN
Mol. Mass.:
109859.29
Organism:
Homo sapiens (Human)
Description:
ChEMBL_586961
Residue:
986
  
Inhibitor
Name:
BDBM50463479
Synonyms:
CHEMBL4249925
Type:
Small organic molecule
Emp. Form.:
C19H17N5O3S2
Mol. Mass.:
427.5
SMILES:
CS(=O)(=O)Nc1cccc(CC(=O)Nc2nc(cs2)-c2c[nH]c3ncccc23)c1
: