Target
Cytoplasmic tyrosine-protein kinase BMX
Ligand
BDBM165209
Substrate
Meas. Tech.
ChEMBL_1778710 (CHEMBL4235702)
IC50
3.3±n/a nM
Citation
 Liu, QBatt, DGChaudhry, CLippy, JSPattoli, MASurti, NXu, SCarter, PHBurke, JRTino, JA Conversion of carbazole carboxamide based reversible inhibitors of Bruton's tyrosine kinase (BTK) into potent, selective irreversible inhibitors in the carbazole, tetrahydrocarbazole, and a new 2,3-dimethylindole series. Bioorg Med Chem Lett 28:3080-3084 (2018)  
Target
Name:
Cytoplasmic tyrosine-protein kinase BMX
Synonyms:
BMX BMX_HUMAN Cytoplasmic tyrosine-protein kinase BMX (BMX) Epithelial and endothelial tyrosine kinase Tyrosine Kinase BMX | Tyrosine-protein kinase BMX/ETK
Type:
Tyrosine-protein kinase
Mol. Mass.:
78030.42
Organism:
Homo sapiens (Human)
Description:
P51813
Residue:
675
  
Inhibitor
Name:
BDBM165209
Synonyms:
US10604504, Example 34 US9688629, 34 US9920031, Example 34
Type:
Small organic molecule
Emp. Form.:
C20H21N3O3S
Mol. Mass.:
383.464
SMILES:
Cc1[nH]c2c(ccc(-c3cccc(NS(=O)(=O)C=C)c3C)c2c1C)C(N)=O
: