Target
Lysyl oxidase homolog 2
Ligand
BDBM50366038
Substrate
Meas. Tech.
ChEMBL_1778828 (CHEMBL4235820)
IC50
18000±n/a nM
Citation
 Hajdú, IKardos, JMajor, BFabó, GL?rincz, ZCseh, SDormán, G Inhibition of the LOX enzyme family members with old and new ligands. Selectivity analysis revisited. Bioorg Med Chem Lett 28:3113-3118 (2018)  
Target
Name:
Lysyl oxidase homolog 2
Synonyms:
1.4.3.13 LOXL2_HUMAN Lysyl oxidase-like protein 2 Lysyl oxidase-related protein WS9-14
Type:
PROTEIN
Mol. Mass.:
86721.38
Organism:
Homo sapiens (Human)
Description:
ChEMBL_115990
Residue:
774
  
Inhibitor
Name:
BDBM50366038
Synonyms:
CHEMBL1356238
Type:
Small organic molecule
Emp. Form.:
C5H5NOS
Mol. Mass.:
127.164
SMILES:
[O-][n+]1ccccc1S
: