Target
Cholesterol side-chain cleavage enzyme, mitochondrial
Ligand
BDBM50024543
Substrate
Meas. Tech.
ChEBML_53751
IC50
209000±n/a nM
Citation
 Leung, CSRowlands, MGJarman, MFoster, ABGriggs, LJWilman, DE Analogues of 3-ethyl-3-(4-pyridyl)piperidine-2,6-dione as selective inhibitors of aromatase: derivatives with variable 1-alkyl and 3-alkyl substituents. J Med Chem 30:1550-4 (1987)  
Target
Name:
Cholesterol side-chain cleavage enzyme, mitochondrial
Synonyms:
CP11A_BOVIN CYPXIA1 Cholesterol side-chain cleavage enzyme, mitochondrial Cytochrome P450 11A1 (CYP11A1) | P450(scc)
Type:
Protein
Mol. Mass.:
60346.75
Organism:
Bos taurus (Bovine)
Description:
P00189
Residue:
520
  
Inhibitor
Name:
BDBM50024543
Synonyms:
3-Ethyl-1-pentyl-4,5-dihydro-3H-[3,4']bipyridinyl-2,6-dione | CHEMBL39513
Type:
Small organic molecule
Emp. Form.:
C17H24N2O2
Mol. Mass.:
288.3847
SMILES:
CCCCCN1C(=O)CCC(CC)(C1=O)c1ccncc1
: