Target
Histone deacetylase 1
Ligand
BDBM50463739
Substrate
Meas. Tech.
ChEMBL_1779292 (CHEMBL4236284)
Ki
0.340000±n/a nM
Citation
 Fournier, JFBhurruth-Alcor, YMusicki, BAubert, JAurelly, MBouix-Peter, CBouquet, KChantalat, LDelorme, MDrean, BDuvert, GFleury-Bregeot, NGauthier, BGrisendi, KHarris, CSHennequin, LFIsabet, TJoly, FLafitte, GMillois, CMorgentin, RPascau, JPiwnica, DRival, YSoulet, CThoreau, ÉTomas, L Squaramides as novel class I and IIB histone deacetylase inhibitors for topical treatment of cutaneous t-cell lymphoma. Bioorg Med Chem Lett 28:2985-2992 (2018)  
Target
Name:
Histone deacetylase 1
Synonyms:
Cereblon/Histone deacetylase 1 HDAC1 Histone deacetylase 1 (HDAC1) RPD3L1
Type:
Enzyme
Mol. Mass.:
55090.27
Organism:
Homo sapiens (Human)
Description:
Q13547
Residue:
482
  
Inhibitor
Name:
BDBM50463739
Synonyms:
CHEMBL4237803
Type:
Small organic molecule
Emp. Form.:
C17H21N3O5
Mol. Mass.:
347.3657
SMILES:
COc1ccc(Nc2c(NCCCCCC(=O)NO)c(=O)c2=O)cc1
: