Target
Histone deacetylase 1
Ligand
BDBM50463765
Substrate
Meas. Tech.
ChEMBL_1779290 (CHEMBL4236282)
Ki
9.4±n/a nM
Citation
 Fournier, JFBhurruth-Alcor, YMusicki, BAubert, JAurelly, MBouix-Peter, CBouquet, KChantalat, LDelorme, MDrean, BDuvert, GFleury-Bregeot, NGauthier, BGrisendi, KHarris, CSHennequin, LFIsabet, TJoly, FLafitte, GMillois, CMorgentin, RPascau, JPiwnica, DRival, YSoulet, CThoreau, ÉTomas, L Squaramides as novel class I and IIB histone deacetylase inhibitors for topical treatment of cutaneous t-cell lymphoma. Bioorg Med Chem Lett 28:2985-2992 (2018)  
Target
Name:
Histone deacetylase 1
Synonyms:
Cereblon/Histone deacetylase 1 HDAC1 Histone deacetylase 1 (HDAC1) RPD3L1
Type:
Enzyme
Mol. Mass.:
55090.27
Organism:
Homo sapiens (Human)
Description:
Q13547
Residue:
482
  
Inhibitor
Name:
BDBM50463765
Synonyms:
CHEMBL4241594
Type:
Small organic molecule
Emp. Form.:
C19H25N3O4
Mol. Mass.:
359.4195
SMILES:
CC[C@H](Nc1c(NCCCCCC(=O)NO)c(=O)c1=O)c1ccccc1
: