Target
Histone deacetylase 4
Ligand
BDBM50463739
Substrate
Meas. Tech.
ChEMBL_1779296 (CHEMBL4236288)
Ki
>10000±n/a nM
Citation
 Fournier, JFBhurruth-Alcor, YMusicki, BAubert, JAurelly, MBouix-Peter, CBouquet, KChantalat, LDelorme, MDrean, BDuvert, GFleury-Bregeot, NGauthier, BGrisendi, KHarris, CSHennequin, LFIsabet, TJoly, FLafitte, GMillois, CMorgentin, RPascau, JPiwnica, DRival, YSoulet, CThoreau, ÉTomas, L Squaramides as novel class I and IIB histone deacetylase inhibitors for topical treatment of cutaneous t-cell lymphoma. Bioorg Med Chem Lett 28:2985-2992 (2018)  
Target
Name:
Histone deacetylase 4
Synonyms:
Cereblon/Histone deacetylase 4 HDAC4 Histone acetylase 4(HDAC4) KIAA0288
Type:
Enzyme
Mol. Mass.:
119049.39
Organism:
Homo sapiens (Human)
Description:
P56524
Residue:
1084
  
Inhibitor
Name:
BDBM50463739
Synonyms:
CHEMBL4237803
Type:
Small organic molecule
Emp. Form.:
C17H21N3O5
Mol. Mass.:
347.3657
SMILES:
COc1ccc(Nc2c(NCCCCCC(=O)NO)c(=O)c2=O)cc1
: