Target
Tyrosine-protein kinase JAK1
Ligand
BDBM50463839
Substrate
Meas. Tech.
ChEMBL_1779476 (CHEMBL4236468)
IC50
12±n/a nM
Citation
 Hamaguchi, HAmano, YMoritomo, AShirakami, SNakajima, YNakai, KNomura, NIto, MHigashi, YInoue, T Discovery and structural characterization of peficitinib (ASP015K) as a novel and potent JAK inhibitor. Bioorg Med Chem 26:4971-4983 (2018)  
Target
Name:
Tyrosine-protein kinase JAK1
Synonyms:
JAK-1 JAK1A JAK1_HUMAN Janus kinase 1 (JAK1) | Janus kinase 1 JAK1
Type:
Protein
Mol. Mass.:
133293.73
Organism:
Homo sapiens (Human)
Description:
P23458
Residue:
1154
  
Inhibitor
Name:
BDBM50463839
Synonyms:
CHEMBL4249444
Type:
Small organic molecule
Emp. Form.:
C18H22N4O
Mol. Mass.:
310.3935
SMILES:
NC(=O)c1cnc2[nH]ccc2c1NC1C2CC3CC(C2)CC1C3
: