Target
Non-receptor tyrosine-protein kinase TYK2
Ligand
BDBM50463838
Substrate
Meas. Tech.
ChEMBL_1779478 (CHEMBL4236470)
IC50
4.8±n/a nM
Citation
 Hamaguchi, HAmano, YMoritomo, AShirakami, SNakajima, YNakai, KNomura, NIto, MHigashi, YInoue, T Discovery and structural characterization of peficitinib (ASP015K) as a novel and potent JAK inhibitor. Bioorg Med Chem 26:4971-4983 (2018)  
Target
Name:
Non-receptor tyrosine-protein kinase TYK2
Synonyms:
Non-receptor tyrosine-protein kinase TYK2 (TYK2) TYK2_HUMAN | Tyrosine-protein kinase TYK2
Type:
Protein
Mol. Mass.:
133666.03
Organism:
Homo sapiens (Human)
Description:
P29597
Residue:
1187
  
Inhibitor
Name:
BDBM50463838
Synonyms:
CHEMBL4238926
Type:
Small organic molecule
Emp. Form.:
C18H22N4O2
Mol. Mass.:
326.3929
SMILES:
NC(=O)c1cnc2[nH]ccc2c1NC1C2CC3CC1CC(O)(C3)C2
: