Target
Tyrosine-protein kinase JAK2
Ligand
BDBM50095984
Substrate
Meas. Tech.
ChEMBL_1779481 (CHEMBL4236473)
IC50
30±n/a nM
Citation
 Hamaguchi, HAmano, YMoritomo, AShirakami, SNakajima, YNakai, KNomura, NIto, MHigashi, YInoue, T Discovery and structural characterization of peficitinib (ASP015K) as a novel and potent JAK inhibitor. Bioorg Med Chem 26:4971-4983 (2018)  
Target
Name:
Tyrosine-protein kinase JAK2
Synonyms:
JAK-2 JAK2_HUMAN Janus kinase 2 (JAK2) | Janus kinase 2 (a protein tyrosine kinase)
Type:
Protein
Mol. Mass.:
130684.68
Organism:
Homo sapiens (Human)
Description:
O60674
Residue:
1132
  
Inhibitor
Name:
BDBM50095984
Synonyms:
CHEMBL3593761
Type:
Small organic molecule
Emp. Form.:
C15H20N4O
Mol. Mass.:
272.3455
SMILES:
C[C@@H]1CCCC[C@@H]1Nc1c(cnc2[nH]ccc12)C(N)=O
: