Target
Tyrosine-protein kinase JAK2
Ligand
BDBM50463841
Substrate
Meas. Tech.
ChEMBL_1779477 (CHEMBL4236469)
IC50
15±n/a nM
Citation
 Hamaguchi, HAmano, YMoritomo, AShirakami, SNakajima, YNakai, KNomura, NIto, MHigashi, YInoue, T Discovery and structural characterization of peficitinib (ASP015K) as a novel and potent JAK inhibitor. Bioorg Med Chem 26:4971-4983 (2018)  
Target
Name:
Tyrosine-protein kinase JAK2
Synonyms:
JAK-2 JAK2_HUMAN Janus kinase 2 (JAK2) | Janus kinase 2 (a protein tyrosine kinase)
Type:
Protein
Mol. Mass.:
130684.68
Organism:
Homo sapiens (Human)
Description:
O60674
Residue:
1132
  
Inhibitor
Name:
BDBM50463841
Synonyms:
CHEMBL4241916
Type:
Small organic molecule
Emp. Form.:
C15H18N4O
Mol. Mass.:
270.3296
SMILES:
[H][C@]12CC[C@]([H])(C1)[C@@H](C2)Nc1c(cnc2[nH]ccc12)C(N)=O
: