Target
Tyrosine-protein kinase JAK3
Ligand
BDBM50463838
Substrate
Meas. Tech.
ChEMBL_1779475 (CHEMBL4236467)
IC50
0.430000±n/a nM
Citation
 Hamaguchi, HAmano, YMoritomo, AShirakami, SNakajima, YNakai, KNomura, NIto, MHigashi, YInoue, T Discovery and structural characterization of peficitinib (ASP015K) as a novel and potent JAK inhibitor. Bioorg Med Chem 26:4971-4983 (2018)  
Target
Name:
Tyrosine-protein kinase JAK3
Synonyms:
JAK-3 JAK3_HUMAN Janus kinase 3 (JAK3) L-JAK | Leukocyte janus kinase
Type:
Protein
Mol. Mass.:
125111.08
Organism:
Homo sapiens (Human)
Description:
P52333
Residue:
1124
  
Inhibitor
Name:
BDBM50463838
Synonyms:
CHEMBL4238926
Type:
Small organic molecule
Emp. Form.:
C18H22N4O2
Mol. Mass.:
326.3929
SMILES:
NC(=O)c1cnc2[nH]ccc2c1NC1C2CC3CC1CC(O)(C3)C2
: