Target
Tyrosine-protein kinase JAK3
Ligand
BDBM50463841
Substrate
Meas. Tech.
ChEMBL_1779475 (CHEMBL4236467)
IC50
3.2±n/a nM
Citation
 Hamaguchi, HAmano, YMoritomo, AShirakami, SNakajima, YNakai, KNomura, NIto, MHigashi, YInoue, T Discovery and structural characterization of peficitinib (ASP015K) as a novel and potent JAK inhibitor. Bioorg Med Chem 26:4971-4983 (2018)  
Target
Name:
Tyrosine-protein kinase JAK3
Synonyms:
JAK-3 JAK3_HUMAN Janus kinase 3 (JAK3) L-JAK | Leukocyte janus kinase
Type:
Protein
Mol. Mass.:
125111.08
Organism:
Homo sapiens (Human)
Description:
P52333
Residue:
1124
  
Inhibitor
Name:
BDBM50463841
Synonyms:
CHEMBL4241916
Type:
Small organic molecule
Emp. Form.:
C15H18N4O
Mol. Mass.:
270.3296
SMILES:
[H][C@]12CC[C@]([H])(C1)[C@@H](C2)Nc1c(cnc2[nH]ccc12)C(N)=O
: