Target
Melatonin receptor type 1A
Ligand
BDBM50464409
Substrate
Meas. Tech.
ChEMBL_1780509 (CHEMBL4252026)
EC50
0.200000±n/a nM
Citation
 Duroux, RRami, MLandagaray, EEttaoussi, MCaignard, DHDelagrange, PMelnyk, PYous, S Synthesis and biological evaluation of new naphtho- and quinolinocyclopentane derivatives as potent melatoninergic (MT Eur J Med Chem 141:552-566 (2017)  
Target
Name:
Melatonin receptor type 1A
Synonyms:
MTNR1A MTR1A_HUMAN Mel1a melatonin receptor Melatonin receptor Melatonin receptor type 1 (MT1) | Melatonin receptor type 1A
Type:
Enzyme
Mol. Mass.:
39392.94
Organism:
Homo sapiens (Human)
Description:
P48039
Residue:
350
  
Inhibitor
Name:
BDBM50464409
Synonyms:
CHEMBL4283539
Type:
Small organic molecule
Emp. Form.:
C16H19N3O2
Mol. Mass.:
285.341
SMILES:
CNC(=O)NCC1CCc2ccc3ccc(OC)nc3c12
: