Target
Enoyl-(Acyl-carrier-protein) reductase II
Ligand
BDBM50464583
Substrate
Meas. Tech.
ChEMBL_1781839 (CHEMBL4253356)
IC50
>256000±n/a nM
Citation
 Hu, YShen, YWu, XTu, XWang, GX Synthesis and biological evaluation of coumarin derivatives containing imidazole skeleton as potential antibacterial agents. Eur J Med Chem 143:958-969 (2018)  
Target
Name:
Enoyl-(Acyl-carrier-protein) reductase II
Synonyms:
Enoyl-(Acyl-carrier-protein) reductase II | fabK
Type:
PROTEIN
Mol. Mass.:
33389.23
Organism:
Streptococcus agalactiae serotype V (strain ATCC BAA-611 / 2603 V/R)
Description:
ChEMBL_117863
Residue:
319
  
Inhibitor
Name:
BDBM50464583
Synonyms:
CHEMBL4292988
Type:
Small organic molecule
Emp. Form.:
C17H18N2O3
Mol. Mass.:
298.3364
SMILES:
Cc1nccn1CCCCOc1ccc2ccc(=O)oc2c1
: