Target
Enoyl-(Acyl-carrier-protein) reductase II
Ligand
BDBM50464586
Substrate
Meas. Tech.
ChEMBL_1781839 (CHEMBL4253356)
IC50
3440±n/a nM
Citation
 Hu, YShen, YWu, XTu, XWang, GX Synthesis and biological evaluation of coumarin derivatives containing imidazole skeleton as potential antibacterial agents. Eur J Med Chem 143:958-969 (2018)  
Target
Name:
Enoyl-(Acyl-carrier-protein) reductase II
Synonyms:
Enoyl-(Acyl-carrier-protein) reductase II | fabK
Type:
PROTEIN
Mol. Mass.:
33389.23
Organism:
Streptococcus agalactiae serotype V (strain ATCC BAA-611 / 2603 V/R)
Description:
ChEMBL_117863
Residue:
319
  
Inhibitor
Name:
BDBM50464586
Synonyms:
CHEMBL4285154
Type:
Small organic molecule
Emp. Form.:
C19H22N2O3
Mol. Mass.:
326.3896
SMILES:
Cc1nccn1CCCCCCOc1ccc2ccc(=O)oc2c1
: