Target
Enoyl-(Acyl-carrier-protein) reductase II
Ligand
BDBM50464590
Substrate
Meas. Tech.
ChEMBL_1781839 (CHEMBL4253356)
IC50
1130±n/a nM
Citation
 Hu, YShen, YWu, XTu, XWang, GX Synthesis and biological evaluation of coumarin derivatives containing imidazole skeleton as potential antibacterial agents. Eur J Med Chem 143:958-969 (2018)  
Target
Name:
Enoyl-(Acyl-carrier-protein) reductase II
Synonyms:
Enoyl-(Acyl-carrier-protein) reductase II | fabK
Type:
PROTEIN
Mol. Mass.:
33389.23
Organism:
Streptococcus agalactiae serotype V (strain ATCC BAA-611 / 2603 V/R)
Description:
ChEMBL_117863
Residue:
319
  
Inhibitor
Name:
BDBM50464590
Synonyms:
CHEMBL4291530
Type:
Small organic molecule
Emp. Form.:
C21H26N2O3
Mol. Mass.:
354.4427
SMILES:
Cc1nccn1CCCCCCCCOc1ccc2ccc(=O)oc2c1
: