Target
Alkaline phosphatase, tissue-nonspecific isozyme
Ligand
BDBM82053
Substrate
Meas. Tech.
ChEMBL_1782193 (CHEMBL4253710)
IC50
>100000±n/a nM
Citation
 Jafari, BOspanov, MEjaz, SAYelibayeva, NKhan, SUAmjad, STSafarov, SAbilov, ZATurmukhanova, MZKalugin, SNEhlers, PLecka, JSévigny, JIqbal, JLanger, P 2-Substituted 7-trifluoromethyl-thiadiazolopyrimidones as alkaline phosphatase inhibitors. Synthesis, structure activity relationship and molecular docking study. Eur J Med Chem 144:116-127 (2018)  
Target
Name:
Alkaline phosphatase, tissue-nonspecific isozyme
Synonyms:
ALPL tissue-nonspecific alkaline phosphatase precursor
Type:
PROTEIN
Mol. Mass.:
57306.17
Organism:
Homo sapiens (Human)
Description:
ChEMBL_1448917
Residue:
524
  
Inhibitor
Name:
BDBM82053
Synonyms:
8-(2-Furyl)theophylline US9144538, Theophylline
Type:
Emp. Form.:
C7H8N4O2
Mol. Mass.:
180.164
SMILES:
Cn1c2[nH]cnc2c(=O)n(C)c1=O
: