Target
Adenosine receptor A2a
Ligand
BDBM50464749
Substrate
Meas. Tech.
ChEMBL_1782292 (CHEMBL4253809)
Ki
>10000±n/a nM
Citation
 Duroux, RAgouridas, LRenault, NEl Bakali, JFurman, CMelnyk, PYous, S Antagonists of the adenosine A Eur J Med Chem 144:151-163 (2018)  
Target
Name:
Adenosine receptor A2a
Synonyms:
A2A adenosine receptor (hA2A) ADENOSINE A2 ADORA2 Adenosine A2A receptor (A2AAR)
Type:
G Protein-Coupled Receptor (GPCR)
Mol. Mass.:
44716.46
Organism:
Homo sapiens (Human)
Description:
P29274
Residue:
412
  
Inhibitor
Name:
BDBM50464749
Synonyms:
CHEMBL4291960
Type:
Small organic molecule
Emp. Form.:
C18H20N4O3
Mol. Mass.:
340.3764
SMILES:
Nc1cc(NC(=O)CN2CCCCC2)c2oc(nc2c1)-c1ccco1
: