Target
Adenosine receptor A2a
Ligand
BDBM50464751
Substrate
Meas. Tech.
ChEMBL_1782292 (CHEMBL4253809)
Ki
30±n/a nM
Citation
 Duroux, RAgouridas, LRenault, NEl Bakali, JFurman, CMelnyk, PYous, S Antagonists of the adenosine A Eur J Med Chem 144:151-163 (2018)  
Target
Name:
Adenosine receptor A2a
Synonyms:
A2A adenosine receptor (hA2A) ADENOSINE A2 ADORA2 Adenosine A2A receptor (A2AAR)
Type:
G Protein-Coupled Receptor (GPCR)
Mol. Mass.:
44716.46
Organism:
Homo sapiens (Human)
Description:
P29274
Residue:
412
  
Inhibitor
Name:
BDBM50464751
Synonyms:
CHEMBL4293876
Type:
Small organic molecule
Emp. Form.:
C27H23N3O4
Mol. Mass.:
453.4892
SMILES:
O=C(CCN1CCc2ccccc2C1)Nc1cc(-c2ccco2)c2oc(nc2c1)-c1ccco1
: