Target
Adenosine receptor A2a
Ligand
BDBM50464752
Substrate
Meas. Tech.
ChEMBL_1782292 (CHEMBL4253809)
Ki
>10000±n/a nM
Citation
 Duroux, RAgouridas, LRenault, NEl Bakali, JFurman, CMelnyk, PYous, S Antagonists of the adenosine A Eur J Med Chem 144:151-163 (2018)  
Target
Name:
Adenosine receptor A2a
Synonyms:
A2A adenosine receptor (hA2A) ADENOSINE A2 ADORA2 Adenosine A2A receptor (A2AAR)
Type:
G Protein-Coupled Receptor (GPCR)
Mol. Mass.:
44716.46
Organism:
Homo sapiens (Human)
Description:
P29274
Residue:
412
  
Inhibitor
Name:
BDBM50464752
Synonyms:
CHEMBL4279128
Type:
Small organic molecule
Emp. Form.:
C15H15N3O3
Mol. Mass.:
285.2979
SMILES:
Nc1cc(N2CCOCC2)c2oc(nc2c1)-c1ccco1
: