Target
Sodium-dependent serotonin transporter
Ligand
BDBM50464855
Substrate
Meas. Tech.
ChEMBL_1783026 (CHEMBL4254543)
IC50
190±n/a nM
Citation
 Gu, ZSZhou, ANXiao, YZhang, QWLi, JQ Synthesis and antidepressant-like activity of novel aralkyl piperazine derivatives targeting SSRI/5-HT Eur J Med Chem 144:701-715 (2018)  
Target
Name:
Sodium-dependent serotonin transporter
Synonyms:
5-HT Transporter 5HT transporter Anandamid membrane transporter, AMT Monoamine transporters; Norepinephrine & serotonin Slc6a4 Sodium-dependent serotonin transporter (SERT) | imipramine receptor
Type:
Multi-pass membrane protein
Mol. Mass.:
70168.43
Organism:
Rattus norvegicus (rat)
Description:
P31652
Residue:
630
  
Inhibitor
Name:
BDBM50464855
Synonyms:
CHEMBL4283479
Type:
Small organic molecule
Emp. Form.:
C27H26N4
Mol. Mass.:
406.5221
SMILES:
N#Cc1ccc2[nH]cc(CCN3CCN(CC3)c3ccccc3-c3ccccc3)c2c1
: