Target
Sodium-dependent serotonin transporter
Ligand
BDBM50400902
Substrate
Meas. Tech.
ChEMBL_1783026 (CHEMBL4254543)
IC50
2.9±n/a nM
Citation
 Gu, ZSZhou, ANXiao, YZhang, QWLi, JQ Synthesis and antidepressant-like activity of novel aralkyl piperazine derivatives targeting SSRI/5-HT Eur J Med Chem 144:701-715 (2018)  
Target
Name:
Sodium-dependent serotonin transporter
Synonyms:
5-HT Transporter 5HT transporter Anandamid membrane transporter, AMT Monoamine transporters; Norepinephrine & serotonin Slc6a4 Sodium-dependent serotonin transporter (SERT) | imipramine receptor
Type:
Multi-pass membrane protein
Mol. Mass.:
70168.43
Organism:
Rattus norvegicus (rat)
Description:
P31652
Residue:
630
  
Inhibitor
Name:
BDBM50400902
Synonyms:
1-(2-(2,4-dimethylphenylsulfanyl)phenyl)piperazine Lu-AA21004 brintellix | vortioxetine hydrobromide
Type:
Small organic molecule
Emp. Form.:
C18H22N2S
Mol. Mass.:
298.446
SMILES:
Cc1ccc(Sc2ccccc2N2CCNCC2)c(C)c1
: