Target
Sodium-dependent serotonin transporter
Ligand
BDBM50464858
Substrate
Meas. Tech.
ChEMBL_1783026 (CHEMBL4254543)
IC50
96±n/a nM
Citation
 Gu, ZSZhou, ANXiao, YZhang, QWLi, JQ Synthesis and antidepressant-like activity of novel aralkyl piperazine derivatives targeting SSRI/5-HT Eur J Med Chem 144:701-715 (2018)  
Target
Name:
Sodium-dependent serotonin transporter
Synonyms:
5-HT Transporter 5HT transporter Anandamid membrane transporter, AMT Monoamine transporters; Norepinephrine & serotonin Slc6a4 Sodium-dependent serotonin transporter (SERT) | imipramine receptor
Type:
Multi-pass membrane protein
Mol. Mass.:
70168.43
Organism:
Rattus norvegicus (rat)
Description:
P31652
Residue:
630
  
Inhibitor
Name:
BDBM50464858
Synonyms:
CHEMBL4294077
Type:
Small organic molecule
Emp. Form.:
C26H25F2N3
Mol. Mass.:
417.4936
SMILES:
Fc1ccc2[nH]cc(CCN3CCN(CC3)c3ccccc3-c3ccccc3F)c2c1
: