Target
Sodium-dependent serotonin transporter
Ligand
BDBM50464859
Substrate
Meas. Tech.
ChEMBL_1783078 (CHEMBL4254595)
Ki
25±n/a nM
Citation
 Gu, ZSZhou, ANXiao, YZhang, QWLi, JQ Synthesis and antidepressant-like activity of novel aralkyl piperazine derivatives targeting SSRI/5-HT Eur J Med Chem 144:701-715 (2018)  
Target
Name:
Sodium-dependent serotonin transporter
Synonyms:
5-HT Transporter 5HTT SC6A4_HUMAN SLC6A4 Serotonin transporter (5HTT) Sodium-dependent serotonin transporter (SERT) | Solute carrier family 6 member 4
Type:
Multi-pass membrane protein
Mol. Mass.:
70322.51
Organism:
Homo sapiens (Human)
Description:
P31645
Residue:
630
  
Inhibitor
Name:
BDBM50464859
Synonyms:
CHEMBL4289361
Type:
Small organic molecule
Emp. Form.:
C23H22FN3O
Mol. Mass.:
375.4387
SMILES:
Fc1cc(N2CCN(CCc3coc4ccccc34)CC2)c2ncccc2c1
: