Target
5-hydroxytryptamine receptor 1A
Ligand
BDBM50464863
Substrate
Meas. Tech.
ChEMBL_1783028 (CHEMBL4254545)
Ki
5.6±n/a nM
Citation
 Gu, ZSZhou, ANXiao, YZhang, QWLi, JQ Synthesis and antidepressant-like activity of novel aralkyl piperazine derivatives targeting SSRI/5-HT Eur J Med Chem 144:701-715 (2018)  
Target
Name:
5-hydroxytryptamine receptor 1A
Synonyms:
5-HT-1A 5-hydroxytryptamine receptor 1A (5-HT-1A) ADRB2RL1 Dopamine D2 receptor and serotonin 1a receptor HTR1A | Serotonin receptor 1A
Type:
Mol. Mass.:
46122.49
Organism:
Homo sapiens (Human)
Description:
Residue:
422
  
Inhibitor
Name:
BDBM50464863
Synonyms:
CHEMBL4285796
Type:
Small organic molecule
Emp. Form.:
C26H25F2N3
Mol. Mass.:
417.4936
SMILES:
Fc1cccc(c1)-c1ccccc1N1CCN(CCc2c[nH]c3ccc(F)cc23)CC1
: