Target
5-hydroxytryptamine receptor 1A
Ligand
BDBM50400902
Substrate
Meas. Tech.
ChEMBL_1783028 (CHEMBL4254545)
Ki
9.5±n/a nM
Citation
 Gu, ZSZhou, ANXiao, YZhang, QWLi, JQ Synthesis and antidepressant-like activity of novel aralkyl piperazine derivatives targeting SSRI/5-HT Eur J Med Chem 144:701-715 (2018)  
Target
Name:
5-hydroxytryptamine receptor 1A
Synonyms:
5-HT-1A 5-hydroxytryptamine receptor 1A (5-HT-1A) ADRB2RL1 Dopamine D2 receptor and serotonin 1a receptor HTR1A | Serotonin receptor 1A
Type:
Mol. Mass.:
46122.49
Organism:
Homo sapiens (Human)
Description:
Residue:
422
  
Inhibitor
Name:
BDBM50400902
Synonyms:
1-(2-(2,4-dimethylphenylsulfanyl)phenyl)piperazine Lu-AA21004 brintellix | vortioxetine hydrobromide
Type:
Small organic molecule
Emp. Form.:
C18H22N2S
Mol. Mass.:
298.446
SMILES:
Cc1ccc(Sc2ccccc2N2CCNCC2)c(C)c1
: