Target
5-hydroxytryptamine receptor 1A
Ligand
BDBM50150105
Substrate
Meas. Tech.
ChEMBL_1783077 (CHEMBL4254594)
Ki
27±n/a nM
Citation
 Gu, ZSZhou, ANXiao, YZhang, QWLi, JQ Synthesis and antidepressant-like activity of novel aralkyl piperazine derivatives targeting SSRI/5-HT Eur J Med Chem 144:701-715 (2018)  
Target
Name:
5-hydroxytryptamine receptor 1A
Synonyms:
5-HT-1A 5-hydroxytryptamine receptor 1A (5-HT-1A) ADRB2RL1 Dopamine D2 receptor and serotonin 1a receptor HTR1A | Serotonin receptor 1A
Type:
Mol. Mass.:
46122.49
Organism:
Homo sapiens (Human)
Description:
Residue:
422
  
Inhibitor
Name:
BDBM50150105
Synonyms:
CHEMBL124069 | [2-(6-Fluoro-chroman-8-yloxy)-ethyl]-[3-(5-fluoro-1H-indol-3-yl)-propyl]-amine
Type:
Small organic molecule
Emp. Form.:
C22H24F2N2O2
Mol. Mass.:
386.435
SMILES:
Fc1cc2CCCOc2c(OCCNCCCc2c[nH]c3ccc(F)cc23)c1
: