Target
Sodium-dependent serotonin transporter
Ligand
BDBM50452372
Substrate
Meas. Tech.
ChEMBL_1783078 (CHEMBL4254595)
Ki
195±n/a nM
Citation
 Gu, ZSZhou, ANXiao, YZhang, QWLi, JQ Synthesis and antidepressant-like activity of novel aralkyl piperazine derivatives targeting SSRI/5-HT Eur J Med Chem 144:701-715 (2018)  
Target
Name:
Sodium-dependent serotonin transporter
Synonyms:
5-HT Transporter 5HTT SC6A4_HUMAN SLC6A4 Serotonin transporter (5HTT) Sodium-dependent serotonin transporter (SERT) | Solute carrier family 6 member 4
Type:
Multi-pass membrane protein
Mol. Mass.:
70322.51
Organism:
Homo sapiens (Human)
Description:
P31645
Residue:
630
  
Inhibitor
Name:
BDBM50452372
Synonyms:
CHEMBL4204665
Type:
Small organic molecule
Emp. Form.:
C22H29N3O2
Mol. Mass.:
367.4846
SMILES:
COc1ccccc1N1CCN(CCCN2CCOc3ccccc23)CC1
: