Target
5-hydroxytryptamine receptor 7
Ligand
BDBM50400902
Substrate
Meas. Tech.
ChEMBL_1783030 (CHEMBL4254547)
Ki
26±n/a nM
Citation
 Gu, ZSZhou, ANXiao, YZhang, QWLi, JQ Synthesis and antidepressant-like activity of novel aralkyl piperazine derivatives targeting SSRI/5-HT Eur J Med Chem 144:701-715 (2018)  
Target
Name:
5-hydroxytryptamine receptor 7
Synonyms:
5-HT-7 5-HT7 5-HT7S 5HT7 HTR7 | Serotonin receptor 7
Type:
G Protein-Coupled Receptor (GPCR)
Mol. Mass.:
53573.08
Organism:
Homo sapiens (Human)
Description:
P34969
Residue:
479
  
Inhibitor
Name:
BDBM50400902
Synonyms:
1-(2-(2,4-dimethylphenylsulfanyl)phenyl)piperazine Lu-AA21004 brintellix | vortioxetine hydrobromide
Type:
Small organic molecule
Emp. Form.:
C18H22N2S
Mol. Mass.:
298.446
SMILES:
Cc1ccc(Sc2ccccc2N2CCNCC2)c(C)c1
: