Target
Alpha-1A adrenergic receptor
Ligand
BDBM50464867
Substrate
Meas. Tech.
ChEMBL_1783042 (CHEMBL4254559)
Ki
28±n/a nM
Citation
 Gu, ZSZhou, ANXiao, YZhang, QWLi, JQ Synthesis and antidepressant-like activity of novel aralkyl piperazine derivatives targeting SSRI/5-HT Eur J Med Chem 144:701-715 (2018)  
Target
Name:
Alpha-1A adrenergic receptor
Synonyms:
ADA1A_HUMAN ADRA1C Alpha 1A-adrenoceptor Alpha adrenergic receptor 1a Alpha-adrenergic receptor 1c adrenergic Alpha1 | adrenergic Alpha1C
Type:
Cell-surface receptors
Mol. Mass.:
51511.67
Organism:
Homo sapiens (Human)
Description:
P35348
Residue:
466
  
Inhibitor
Name:
BDBM50464867
Synonyms:
CHEMBL4289783
Type:
Small organic molecule
Emp. Form.:
C27H27F2N3
Mol. Mass.:
431.5202
SMILES:
Fc1ccc(N2CCN(CCCc3c[nH]c4ccc(F)cc34)CC2)c(c1)-c1ccccc1
: