Target
5-hydroxytryptamine receptor 7
Ligand
BDBM50464858
Substrate
Meas. Tech.
ChEMBL_1783030 (CHEMBL4254547)
Ki
2.3±n/a nM
Citation
 Gu, ZSZhou, ANXiao, YZhang, QWLi, JQ Synthesis and antidepressant-like activity of novel aralkyl piperazine derivatives targeting SSRI/5-HT Eur J Med Chem 144:701-715 (2018)  
Target
Name:
5-hydroxytryptamine receptor 7
Synonyms:
5-HT-7 5-HT7 5-HT7S 5HT7 HTR7 | Serotonin receptor 7
Type:
G Protein-Coupled Receptor (GPCR)
Mol. Mass.:
53573.08
Organism:
Homo sapiens (Human)
Description:
P34969
Residue:
479
  
Inhibitor
Name:
BDBM50464858
Synonyms:
CHEMBL4294077
Type:
Small organic molecule
Emp. Form.:
C26H25F2N3
Mol. Mass.:
417.4936
SMILES:
Fc1ccc2[nH]cc(CCN3CCN(CC3)c3ccccc3-c3ccccc3F)c2c1
: