Target
5-hydroxytryptamine receptor 1A
Ligand
BDBM50464867
Substrate
Meas. Tech.
ChEMBL_1783028 (CHEMBL4254545)
Ki
28±n/a nM
Citation
 Gu, ZSZhou, ANXiao, YZhang, QWLi, JQ Synthesis and antidepressant-like activity of novel aralkyl piperazine derivatives targeting SSRI/5-HT Eur J Med Chem 144:701-715 (2018)  
Target
Name:
5-hydroxytryptamine receptor 1A
Synonyms:
5-HT-1A 5-hydroxytryptamine receptor 1A (5-HT-1A) ADRB2RL1 Dopamine D2 receptor and serotonin 1a receptor HTR1A | Serotonin receptor 1A
Type:
Mol. Mass.:
46122.49
Organism:
Homo sapiens (Human)
Description:
Residue:
422
  
Inhibitor
Name:
BDBM50464867
Synonyms:
CHEMBL4289783
Type:
Small organic molecule
Emp. Form.:
C27H27F2N3
Mol. Mass.:
431.5202
SMILES:
Fc1ccc(N2CCN(CCCc3c[nH]c4ccc(F)cc34)CC2)c(c1)-c1ccccc1
: