Target
5-hydroxytryptamine receptor 7
Ligand
BDBM50464863
Substrate
Meas. Tech.
ChEMBL_1783030 (CHEMBL4254547)
Ki
0.790000±n/a nM
Citation
 Gu, ZSZhou, ANXiao, YZhang, QWLi, JQ Synthesis and antidepressant-like activity of novel aralkyl piperazine derivatives targeting SSRI/5-HT Eur J Med Chem 144:701-715 (2018)  
Target
Name:
5-hydroxytryptamine receptor 7
Synonyms:
5-HT-7 5-HT7 5-HT7S 5HT7 HTR7 | Serotonin receptor 7
Type:
G Protein-Coupled Receptor (GPCR)
Mol. Mass.:
53573.08
Organism:
Homo sapiens (Human)
Description:
P34969
Residue:
479
  
Inhibitor
Name:
BDBM50464863
Synonyms:
CHEMBL4285796
Type:
Small organic molecule
Emp. Form.:
C26H25F2N3
Mol. Mass.:
417.4936
SMILES:
Fc1cccc(c1)-c1ccccc1N1CCN(CCc2c[nH]c3ccc(F)cc23)CC1
: