Target
Sodium-dependent serotonin transporter
Ligand
BDBM50464867
Substrate
Meas. Tech.
ChEMBL_1783026 (CHEMBL4254543)
IC50
25±n/a nM
Citation
 Gu, ZSZhou, ANXiao, YZhang, QWLi, JQ Synthesis and antidepressant-like activity of novel aralkyl piperazine derivatives targeting SSRI/5-HT Eur J Med Chem 144:701-715 (2018)  
Target
Name:
Sodium-dependent serotonin transporter
Synonyms:
5-HT Transporter 5HT transporter Anandamid membrane transporter, AMT Monoamine transporters; Norepinephrine & serotonin Slc6a4 Sodium-dependent serotonin transporter (SERT) | imipramine receptor
Type:
Multi-pass membrane protein
Mol. Mass.:
70168.43
Organism:
Rattus norvegicus (rat)
Description:
P31652
Residue:
630
  
Inhibitor
Name:
BDBM50464867
Synonyms:
CHEMBL4289783
Type:
Small organic molecule
Emp. Form.:
C27H27F2N3
Mol. Mass.:
431.5202
SMILES:
Fc1ccc(N2CCN(CCCc3c[nH]c4ccc(F)cc34)CC2)c(c1)-c1ccccc1
: