Target
Sodium-dependent serotonin transporter
Ligand
BDBM50150105
Substrate
Meas. Tech.
ChEMBL_1783078 (CHEMBL4254595)
Ki
0.470000±n/a nM
Citation
 Gu, ZSZhou, ANXiao, YZhang, QWLi, JQ Synthesis and antidepressant-like activity of novel aralkyl piperazine derivatives targeting SSRI/5-HT Eur J Med Chem 144:701-715 (2018)  
Target
Name:
Sodium-dependent serotonin transporter
Synonyms:
5-HT Transporter 5HTT SC6A4_HUMAN SLC6A4 Serotonin transporter (5HTT) Sodium-dependent serotonin transporter (SERT) | Solute carrier family 6 member 4
Type:
Multi-pass membrane protein
Mol. Mass.:
70322.51
Organism:
Homo sapiens (Human)
Description:
P31645
Residue:
630
  
Inhibitor
Name:
BDBM50150105
Synonyms:
CHEMBL124069 | [2-(6-Fluoro-chroman-8-yloxy)-ethyl]-[3-(5-fluoro-1H-indol-3-yl)-propyl]-amine
Type:
Small organic molecule
Emp. Form.:
C22H24F2N2O2
Mol. Mass.:
386.435
SMILES:
Fc1cc2CCCOc2c(OCCNCCCc2c[nH]c3ccc(F)cc23)c1
: