Target
4-aminobutyrate aminotransferase, mitochondrial
Ligand
BDBM50024970
Substrate
Meas. Tech.
ChEBML_70673
Ki
5000±n/a nM
Citation
 Silverman, RBDurkee, SCInvergo, BJ 4-Amino-2-(substituted methyl)-2-butenoic acids: substrates and potent inhibitors of gamma-aminobutyric acid aminotransferase. J Med Chem 29:764-70 (1986)  
Target
Name:
4-aminobutyrate aminotransferase, mitochondrial
Synonyms:
(S)-3-amino-2-methylpropionate transaminase 2.6.1.22 ABAT GABA transaminase GABA-T GABT_PIG L-AIBAT
Type:
Mol. Mass.:
56633.06
Organism:
Sus scrofa
Description:
Residue:
500
  
Inhibitor
Name:
BDBM50024970
Synonyms:
(2E)-4-ammonio-2-(hydroxymethyl)but-2-enoate | CHEMBL349501
Type:
Small organic molecule
Emp. Form.:
C5H9NO3
Mol. Mass.:
131.1299
SMILES:
[NH3+]C\C=C(/CO)C([O-])=O
: