Target
Cannabinoid receptor 2
Ligand
BDBM50465041
Substrate
Meas. Tech.
ChEMBL_1783752 (CHEMBL4255269)
Ki
>10000±n/a nM
Citation
 Cooper, AGMacDonald, CGlass, MHook, STyndall, JDAVernall, AJ Alkyl indole-based cannabinoid type 2 receptor tools: Exploration of linker and fluorophore attachment. Eur J Med Chem 145:770-789 (2018)  
Target
Name:
Cannabinoid receptor 2
Synonyms:
CANNABINOID CB2 CB2 CB2B CNR2_HUMAN Cannabinoid CB2 receptor Cannabinoid receptor 2 (CB2R) | hCB2
Type:
G Protein-Coupled Receptor (GPCR)
Mol. Mass.:
39690.94
Organism:
Homo sapiens (Human)
Description:
P34972
Residue:
360
  
Inhibitor
Name:
BDBM50465041
Synonyms:
CHEMBL4282454
Type:
Small organic molecule
Emp. Form.:
C33H40N4O6
Mol. Mass.:
588.6939
SMILES:
NCCOCCOCCNC(=O)COc1ccc2n(CCN3CCOCC3)cc(C(=O)c3cccc4ccccc34)c2c1
: