Target
Cannabinoid receptor 1
Ligand
BDBM50465024
Substrate
Meas. Tech.
ChEMBL_1783764 (CHEMBL4255281)
EC50
63±n/a nM
Citation
 Cooper, AGMacDonald, CGlass, MHook, STyndall, JDAVernall, AJ Alkyl indole-based cannabinoid type 2 receptor tools: Exploration of linker and fluorophore attachment. Eur J Med Chem 145:770-789 (2018)  
Target
Name:
Cannabinoid receptor 1
Synonyms:
CANN6 CB-R CNR CNR1_HUMAN Cannabinoid receptor Cannabinoid receptor 1 (brain)
Type:
G Protein-Coupled Receptor (GPCR)
Mol. Mass.:
52868.96
Organism:
Homo sapiens (Human)
Description:
P21554
Residue:
472
  
Inhibitor
Name:
BDBM50465024
Synonyms:
CHEMBL4284943
Type:
Small organic molecule
Emp. Form.:
C22H23NO4
Mol. Mass.:
365.4223
SMILES:
COc1ccc(cc1)C(=O)c1cn(CC2CCOCC2)c2ccc(O)cc12
: