Target
Presenilin-1
Ligand
BDBM50465076
Substrate
Meas. Tech.
ChEMBL_1784107 (CHEMBL4255624)
EC50
19±n/a nM
Citation
 Blass, BE Azabicyclic Fused Pyrimidine Derivatives Useful for the Treatment of Alzheimer's Disease. ACS Med Chem Lett 9:165-166 (2018)  
Target
Name:
Presenilin-1
Synonyms:
3.4.23.- Gamma-Secretase Subunit Presenilin-1 PS1 PSEN1 PSNL1 Presenilin-1 CTF12 Protein S182
Type:
Mol. Mass.:
52657.13
Organism:
Homo sapiens (Human)
Description:
P49768
Residue:
467
  
Inhibitor
Name:
BDBM50465076
Synonyms:
CHEMBL4290617
Type:
Small organic molecule
Emp. Form.:
C26H31FN8
Mol. Mass.:
474.5763
SMILES:
[H][C@]12CC[C@]([H])(CN(C1)c1ccnnc1)[C@H]2Nc1nc2N(CC(C)(C)c2c(NC)n1)c1ccc(F)cc1
: