Target
Phospho-N-acetylmuramoyl-pentapeptide-transferase
Ligand
BDBM50465326
Substrate
Meas. Tech.
ChEMBL_1784569 (CHEMBL4256086)
IC50
0.004±n/a nM
Citation
 Cui, ZWang, XKoppermann, SThorson, JSDucho, CVan Lanen, SG Antibacterial Muraymycins from Mutant Strains of Streptomyces sp. NRRL 30471. J Nat Prod 81:942-948 (2018)  
Target
Name:
Phospho-N-acetylmuramoyl-pentapeptide-transferase
Synonyms:
MRAY_STAAU | mraY
Type:
PROTEIN
Mol. Mass.:
35238.55
Organism:
Staphylococcus aureus (strain MRSA252)
Description:
ChEMBL_827497
Residue:
321
  
Inhibitor
Name:
BDBM50465326
Synonyms:
CHEMBL4283345
Type:
Small organic molecule
Emp. Form.:
C54H93N11O18
Mol. Mass.:
1184.3791
SMILES:
[H][C@](O[C@@H]1O[C@H](CN)[C@@H](O)[C@H]1OC)([C@H](NCCCNC(=O)[C@@H](NC(=O)[C@@H](NC(=O)N[C@@H](C(C)C)C(O)=O)[C@]1([H])CCNC(=N)N1)[C@@H](OC(=O)CCCCCCCCCCCCC(C)C)C(C)C)C(O)=O)[C@@]1([H])O[C@H]([C@H](O)[C@@H]1O)n1ccc(=O)[nH]c1=O
: