Target
Lysine--tRNA ligase
Ligand
BDBM50465342
Substrate
Meas. Tech.
ChEMBL_1784613 (CHEMBL4256130)
IC50
11±n/a nM
Citation
 Gao, JBYang, SJYan, ZRZhang, XJPu, DBWang, LXLi, XLZhang, RHXiao, WL Isolation, Characterization, and Structure-Activity Relationship Analysis of Abietane Diterpenoids from Callicarpa bodinieri as Spleen Tyrosine Kinase Inhibitors. J Nat Prod 81:998-1006 (2018)  
Target
Name:
Lysine--tRNA ligase
Synonyms:
KARS KIAA0070 SYK_HUMAN
Type:
PROTEIN
Mol. Mass.:
68044.78
Organism:
Homo sapiens (Human)
Description:
ChEMBL_960665
Residue:
597
  
Inhibitor
Name:
BDBM50465342
Synonyms:
CHEMBL4293812
Type:
Small organic molecule
Emp. Form.:
C22H28O4
Mol. Mass.:
356.4553
SMILES:
[H][C@@]12CCc3cc(ccc3[C@@]1(C)CCC[C@@]2(CC(=O)OC)C(O)=O)C(C)=C
: