Target
Lysine--tRNA ligase
Ligand
BDBM50465346
Substrate
Meas. Tech.
ChEMBL_1784613 (CHEMBL4256130)
IC50
7.2±n/a nM
Citation
 Gao, JBYang, SJYan, ZRZhang, XJPu, DBWang, LXLi, XLZhang, RHXiao, WL Isolation, Characterization, and Structure-Activity Relationship Analysis of Abietane Diterpenoids from Callicarpa bodinieri as Spleen Tyrosine Kinase Inhibitors. J Nat Prod 81:998-1006 (2018)  
Target
Name:
Lysine--tRNA ligase
Synonyms:
KARS KIAA0070 SYK_HUMAN
Type:
PROTEIN
Mol. Mass.:
68044.78
Organism:
Homo sapiens (Human)
Description:
ChEMBL_960665
Residue:
597
  
Inhibitor
Name:
BDBM50465346
Synonyms:
CHEMBL4286991
Type:
Small organic molecule
Emp. Form.:
C20H28O3
Mol. Mass.:
316.4345
SMILES:
[H][C@@]12CCc3cc(ccc3[C@@]1(C)CCC[C@]2(CO)C(O)=O)C(C)C
: