Target
Presenilin-1
Ligand
BDBM50465354
Substrate
Meas. Tech.
ChEMBL_1784703 (CHEMBL4256220)
EC50
7.0±n/a nM
Citation
 Blass, BE Azabicyclic Fused Pyrimidine Derivatives Useful for the Treatment of Alzheimer's Disease. ACS Med Chem Lett 9:290-291 (2018)  
Target
Name:
Presenilin-1
Synonyms:
3.4.23.- Gamma-Secretase Subunit Presenilin-1 PS1 PSEN1 PSNL1 Presenilin-1 CTF12 Protein S182
Type:
Mol. Mass.:
52657.13
Organism:
Homo sapiens (Human)
Description:
P49768
Residue:
467
  
Inhibitor
Name:
BDBM50465354
Synonyms:
CHEMBL4293045 | US10669276, Example 4
Type:
Small organic molecule
Emp. Form.:
C25H25ClFN7O
Mol. Mass.:
493.964
SMILES:
CNc1nc(Nc2ccc(c(OC)c2)-n2cnc(Cl)c2)nc2N(CC(C)(C)c12)c1ccc(F)cc1
: