Target
Presenilin-1
Ligand
BDBM50465360
Substrate
Meas. Tech.
ChEMBL_1784703 (CHEMBL4256220)
EC50
8.0±n/a nM
Citation
 Blass, BE Azabicyclic Fused Pyrimidine Derivatives Useful for the Treatment of Alzheimer's Disease. ACS Med Chem Lett 9:290-291 (2018)  
Target
Name:
Presenilin-1
Synonyms:
3.4.23.- Gamma-Secretase Subunit Presenilin-1 PS1 PSEN1 PSNL1 Presenilin-1 CTF12 Protein S182
Type:
Mol. Mass.:
52657.13
Organism:
Homo sapiens (Human)
Description:
P49768
Residue:
467
  
Inhibitor
Name:
BDBM50465360
Synonyms:
CHEMBL4294948 | US10669276, Example 28
Type:
Small organic molecule
Emp. Form.:
C26H29FN8O2
Mol. Mass.:
504.5593
SMILES:
COc1cc(Nc2nc3N(CC(C)(C)c3c(NCCO)n2)c2ccc(F)cc2)ccc1-n1cnc(C)n1
: