Target
Presenilin-1
Ligand
BDBM50465363
Substrate
Meas. Tech.
ChEMBL_1784703 (CHEMBL4256220)
EC50
13±n/a nM
Citation
 Blass, BE Azabicyclic Fused Pyrimidine Derivatives Useful for the Treatment of Alzheimer's Disease. ACS Med Chem Lett 9:290-291 (2018)  
Target
Name:
Presenilin-1
Synonyms:
3.4.23.- Gamma-Secretase Subunit Presenilin-1 PS1 PSEN1 PSNL1 Presenilin-1 CTF12 Protein S182
Type:
Mol. Mass.:
52657.13
Organism:
Homo sapiens (Human)
Description:
P49768
Residue:
467
  
Inhibitor
Name:
BDBM50465363
Synonyms:
CHEMBL4278310 | US10669276, Example 35
Type:
Small organic molecule
Emp. Form.:
C26H29FN8O
Mol. Mass.:
488.5599
SMILES:
CNc1nc(Nc2ccc(c(OC)c2)-n2cnc(C)n2)nc2N(CCC(C)(C)c12)c1ccc(F)cc1
: