Target
Neuronal acetylcholine receptor subunit alpha-3/beta-4
Ligand
BDBM50465456
Substrate
Meas. Tech.
ChEMBL_1785003 (CHEMBL4256520)
Ki
11±n/a nM
Citation
 Fitch, RWSnider, BBZhou, QFoxman, BMPandya, AAYakel, JLOlson, TTAl-Muhtasib, NXiao, YWelch, KDPanter, KE Absolute Configuration and Pharmacology of the Poison Frog Alkaloid Phantasmidine. J Nat Prod 81:1029-1035 (2018)  
Target
Name:
Neuronal acetylcholine receptor subunit alpha-3/beta-4
Synonyms:
Neuronal acetylcholine receptor protein alpha-3/beta-4 subunit | Neuronal acetylcholine receptor; alpha3/beta4
Type:
Mol. Mass.:
Description:
ASSAY_ID of ChEMBL is 1970247
Components:
This complex has 2 components.
Component 1
Name:
Neuronal acetylcholine receptor subunit beta-4
Synonyms:
ACHB4_HUMAN Cholinergic, Nicotinic Alpha6Beta3Beta4Alpha5 Nicotinic acetylcholine receptor alpha6/alpha3/beta4
Type:
Enzyme Catalytic Domain
Mol. Mass.:
56388.51
Organism:
Homo sapiens (Human)
Description:
Cholinergic, Nicotinic Alpha6Beta3Beta4Alpha5 0 HUMAN::P30926
Residue:
498
  
Component 2
Name:
Neuronal acetylcholine receptor subunit alpha-3
Synonyms:
ACHA3_HUMAN Cholinergic, Nicotinic Alpha3Beta2 Cholinergic, Nicotinic Alpha3Beta4x NACHRA3 Neuronal acetylcholine receptor subunit alpha-3 nicotinic central
Type:
Enzyme Catalytic Domain
Mol. Mass.:
57479.03
Organism:
Homo sapiens (Human)
Description:
Cholinergic, Nicotinic Alpha3Beta2 0 HUMAN::P32297
Residue:
505
  
Inhibitor
Name:
BDBM50465456
Synonyms:
CHEMBL4283703
Type:
Small organic molecule
Emp. Form.:
C11H11ClN2O
Mol. Mass.:
222.671
SMILES:
Clc1ccc2C3CNC4CCC34Oc2n1
: