Target
Sodium channel protein type 1 subunit alpha
Ligand
BDBM268527
Substrate
Meas. Tech.
ChEMBL_1785072 (CHEMBL4256589)
IC50
112±n/a nM
Citation
 Focken, TChowdhury, SZenova, AGrimwood, MEChabot, CSheng, THemeon, IDecker, SMWilson, MBichler, PJia, QSun, SYoung, CLin, SGoodchild, SJShuart, NGChang, EXie, ZLi, BKhakh, KBankar, GWaldbrook, MKwan, RNelkenbrecher, KKarimi Tari, PChahal, NSojo, LRobinette, CLWhite, ADChen, CAZhang, YPang, JChang, JHHackos, DHJohnson, JPCohen, CJOrtwine, DFSutherlin, DPDehnhardt, CMSafina, BS Design of Conformationally Constrained Acyl Sulfonamide Isosteres: Identification of N-([1,2,4]Triazolo[4,3- a]pyridin-3-yl)methane-sulfonamides as Potent and Selective hNa J Med Chem 61:4810-4831 (2018)  
Target
Name:
Sodium channel protein type 1 subunit alpha
Synonyms:
NAC1 SCN1A Sodium (Site 1) Sodium channel protein type 1 subunit alpha Sodium channel protein type I subunit alpha Voltage-gated sodium channel subunit alpha Nav1.1
Type:
Protein
Mol. Mass.:
228952.47
Organism:
Homo sapiens (Human)
Description:
P35498
Residue:
2009
  
Inhibitor
Name:
BDBM268527
Synonyms:
N-(6-cyclopropyl-7-((3,5-dichlorophenoxy)methyl)-[1,2,4]triazolo[4,3-a]pyridin-3-yl)methanesulfonamide US9550775, 51
Type:
Small organic molecule
Emp. Form.:
C17H16Cl2N4O3S
Mol. Mass.:
427.305
SMILES:
CS(=O)(=O)Nc1nnc2cc(COc3cc(Cl)cc(Cl)c3)c(cn12)C1CC1
: