Target
Aromatase
Ligand
BDBM50025153
Substrate
Meas. Tech.
ChEMBL_50691 (CHEMBL663078)
IC50
15600±n/a nM
Citation
 Daly, MJJones, GWNicholls, PJSmith, HJRowlands, MGBunnett, MA Synthesis and biochemical evaluation of analogues of aminoglutethimide based on phenylpyrrolidine-2,5-dione. J Med Chem 29:520-3 (1986)  
Target
Name:
Aromatase
Synonyms:
ARO1 CP19A_HUMAN CYP19 CYPXIX Cytochrome P450 19A1 Cytochrome P450-C19 (CYP19) FL cytokine receptor precursor | P-450AROM
Type:
Enzyme
Mol. Mass.:
57888.92
Organism:
Homo sapiens (Human)
Description:
P11511
Residue:
503
  
Inhibitor
Name:
BDBM50025153
Synonyms:
3-(4-Amino-phenyl)-1,3-dimethyl-pyrrolidine-2,5-dione | CHEMBL151691
Type:
Small organic molecule
Emp. Form.:
C12H14N2O2
Mol. Mass.:
218.2518
SMILES:
CN1C(=O)CC(C)(C1=O)c1ccc(N)cc1
: