Target
Aromatase
Ligand
BDBM50025155
Substrate
Meas. Tech.
ChEMBL_50691 (CHEMBL663078)
IC50
12500±n/a nM
Citation
 Daly, MJJones, GWNicholls, PJSmith, HJRowlands, MGBunnett, MA Synthesis and biochemical evaluation of analogues of aminoglutethimide based on phenylpyrrolidine-2,5-dione. J Med Chem 29:520-3 (1986)  
Target
Name:
Aromatase
Synonyms:
ARO1 CP19A_HUMAN CYP19 CYPXIX Cytochrome P450 19A1 Cytochrome P450-C19 (CYP19) FL cytokine receptor precursor | P-450AROM
Type:
Enzyme
Mol. Mass.:
57888.92
Organism:
Homo sapiens (Human)
Description:
P11511
Residue:
503
  
Inhibitor
Name:
BDBM50025155
Synonyms:
3-(4-Amino-phenyl)-3-methyl-pyrrolidine-2,5-dione | CHEMBL149238
Type:
Small organic molecule
Emp. Form.:
C11H12N2O2
Mol. Mass.:
204.2252
SMILES:
CC1(CC(=O)NC1=O)c1ccc(N)cc1
: